Buildfehler bei Version 1.22

Hallo zusammen,

ich hoffe jemand kann mir bei meinem Problem helfen. Ich versuche seit gestern erfolglos die Version 1.22 von Github zu kompilieren.

Mein System ist:
Windows 10 (64) Build 19042.867
Java-Version:

java version "1.8.0_281"
Java(TM) SE Runtime Environment (build 1.8.0_281-b09)
Java HotSpot(TM) 64-Bit Server VM (build 25.281-b09, mixed mode)

Fehler:

[INFO] sernet.hui.common 1.1.1-SNAPSHOT ................... FAILURE [  0.072 s]
[INFO] sernet.gs.service 1.12.0-SNAPSHOT .................. SKIPPED
[INFO] sernet.hui.swtclient 1.1.2-SNAPSHOT ................ SKIPPED
[INFO] sernet.springclient 1.2.2-SNAPSHOT ................. SKIPPED
[INFO] sernet.gs.ui.rcp.main 1.22.0-SNAPSHOT .............. SKIPPED
[INFO] sernet.verinice.oda.driver 1.0.0-SNAPSHOT .......... SKIPPED
[INFO] sernet.verinice.samt.service 0.1.0-SNAPSHOT ........ SKIPPED
[INFO] sernet.verinice.report.service 1.0.0-SNAPSHOT ...... SKIPPED
[INFO] sernet.verinice.fei.service 1.0.0-SNAPSHOT ......... SKIPPED
[INFO] sernet.gs.server 1.22.0-SNAPSHOT ................... SKIPPED
[INFO] sernet.gs.server.feature 1.1.1-SNAPSHOT ............ SKIPPED
[INFO] sernet.gs.springweb.fragment 1.1.1 ................. SKIPPED
[INFO] sernet.localdependencies 1.22.0-SNAPSHOT ........... SKIPPED
[INFO] sernet.verinice.fei.rcp 1.0.0-SNAPSHOT ............. SKIPPED
[INFO] sernet.verinice.samt.rcp 0.1.0-SNAPSHOT ............ SKIPPED
[INFO] sernet.verinice.desktop.integration 1.22.0-SNAPSHOT  SKIPPED
[INFO] waffle 1.7.3 ....................................... SKIPPED
[INFO] sernet.verinice.kerberos 1.22.0-SNAPSHOT ........... SKIPPED
[INFO] sernet.rcp.ui.feature 1.0.0-SNAPSHOT ............... SKIPPED
[INFO] sernet.thirdparty.feature 1.22.0-SNAPSHOT .......... SKIPPED
[INFO] sernet.verinice.lang.feature 1.22.0-SNAPSHOT ....... SKIPPED
[INFO] sernet.verinice.extraresources.jre_linux_64 1.22.0-SNAPSHOT SKIPPED
[INFO] sernet.verinice.extraresources.jre_win_64 1.22.0-SNAPSHOT SKIPPED
[INFO] sernet.verinice.extraresources.jre_macos_64 1.22.0-SNAPSHOT SKIPPED
[INFO] sernet.verinice.extraresources.feature 1.0.0-SNAPSHOT SKIPPED
[INFO] sernet.verinice.app.feature 1.22.0-SNAPSHOT ........ SKIPPED
[INFO] sernet.verinice.releng.client.product 1.22.0-SNAPSHOT SKIPPED
[INFO] sernet.verinice.releng.server.product 1.22.0-SNAPSHOT SKIPPED
[INFO] sernet.verinice.bp.importer 1.0.0-SNAPSHOT ......... SKIPPED
[INFO] sernet.gs.server.tests 1.22.0-SNAPSHOT ............. SKIPPED
[INFO] sernet.gs.service.tests 1.12.0-SNAPSHOT ............ SKIPPED
[INFO] sernet.gs.ui.rcp.main.tests 1.22.0-SNAPSHOT ........ SKIPPED
[INFO] ------------------------------------------------------------------------
[INFO] BUILD FAILURE
[INFO] ------------------------------------------------------------------------
[INFO] Total time:  06:31 min
[INFO] Finished at: 2021-04-02T09:11:07+02:00
[INFO] ------------------------------------------------------------------------
[ERROR] Failed to execute goal org.eclipse.tycho:tycho-packaging-plugin:1.7.0:package-plugin (default-package-plugin) on project sernet.hui.common: C:\verinice-1.22.0\sernet.hui.common\build.properties: bin.includes value(s) must be specified. -> [Help 1]

Die Version 1.21 kann ich ohne Probleme kompilieren. Vielleicht kann mir jemand einen Tip geben woran es liegen kann. Ist es evtl. empfehlenswerter unter Linux zu bauen?

Vielen Dank schonmal im voraus.

Viele GrĂŒĂŸe
Heiko

Hallo nochmal. Ich habe das Problem mittlerweile gefunden :slight_smile: . Es lag an einer leeren ‚build.properties‘ in ‚sernet.hui.common‘. Nachdem ich das korrigiert habe lief der Build durch. Demzufolge kann der Thread geschlossen werden.

Viele GrĂŒĂŸe
Heiko

1 Like